Search found 3 matches

by tosser
Mon Oct 14, 2019 1:32 pm
Forum: Installing and getting connected
Topic: Compile errors
Replies: 6
Views: 2018

Re: Compile errors

Thanks a lot! :D
Problem solved, using third option - recompile openssl (./config -fPIC shared)
by tosser
Thu Oct 10, 2019 5:40 am
Forum: Installing and getting connected
Topic: Compile errors
Replies: 6
Views: 2018

Re: Compile errors

Of course!
Here is a link to CLI history (link will be active 7 days).
History as long as buffer can store.
by tosser
Mon Sep 30, 2019 12:33 pm
Forum: Installing and getting connected
Topic: Compile errors
Replies: 6
Views: 2018

Re: Compile errors

Please, help! When compiling, have following errors: ... /usr/bin/ld: final link failed: nonrepresentable section on output collect2: error: ld returned 1 exit status make[1]: *** [Makefile:62: ircd] Error 1 make[1]: Leaving directory '/home/sakura/unrealircd-4.2.4.1/src' make: *** [Makefile:141: bu...