Page 1 of 1

Compile errors

Posted: Sun Aug 11, 2019 9:05 am
by Remco
Can anyone help me? Upon compiling i get this message, what problem does cause this?

/usr/bin/ld: cannot find -lssl
/usr/bin/ld: cannot find -lcrypto
/usr/bin/ld: cannot find -lssl
/usr/bin/ld: cannot find -lcrypto
collect2: error: ld returned 1 exit status
Makefile:62: recipe for target 'ircd' failed
make[1]: *** [ircd] Error 1
make[1]: Map '/home/remco/unrealircd-4.2.4.1/src' wordt verlaten
Makefile:140: recipe for target 'build' failed
make: *** [build] Error 2

Re: Compile errors

Posted: Sun Aug 11, 2019 10:22 am
by Remco
Solved it myself with the --without-system-argon2
parameter :)