Compile errors

If you hit any installation issues or cannot connect to your freshly installed UnrealIRCd then this forum is for you.

Moderator: Supporters

Post Reply
Remco
Posts: 2
Joined: Sun Aug 11, 2019 9:01 am

Compile errors

Post by Remco » Sun Aug 11, 2019 9:05 am

Can anyone help me? Upon compiling i get this message, what problem does cause this?

/usr/bin/ld: cannot find -lssl
/usr/bin/ld: cannot find -lcrypto
/usr/bin/ld: cannot find -lssl
/usr/bin/ld: cannot find -lcrypto
collect2: error: ld returned 1 exit status
Makefile:62: recipe for target 'ircd' failed
make[1]: *** [ircd] Error 1
make[1]: Map '/home/remco/unrealircd-4.2.4.1/src' wordt verlaten
Makefile:140: recipe for target 'build' failed
make: *** [build] Error 2

Remco
Posts: 2
Joined: Sun Aug 11, 2019 9:01 am

Re: Compile errors

Post by Remco » Sun Aug 11, 2019 10:22 am

Solved it myself with the --without-system-argon2
parameter :)

Post Reply